{"text_format":"1","workbook":"xlsx","n_sheets":6,"sheets":["申込一覧表A","印刷","種目人数表B","混成申込","初期設定","DAT"],"not_rendered":{"charts":0,"images":0,"macros":1,"external_links":0,"defined_names":8,"comments":2,"pivot_tables":0},"unopened":[],"bounds":{"document_bytes":16777216,"sheet_cells":100000,"rows_first":2000,"rows_last":500,"rows_between":2000,"halvings":0,"cell_chars":16384,"cell_head_chars":4096},"cells_cut":0,"cells_raw":0,"read":"whole","date_system":"1900"}

{"sheet":"申込一覧表A","index":0,"n_rows":97,"n_cols":35,"rows_kept":97,"cut":false,"hidden":false,"merged":[[0,1,0,2],[0,3,0,6],[0,7,0,9],[0,10,0,11],[0,12,0,13],[0,14,0,15],[0,16,0,17],[0,18,0,22],[1,1,1,2],[1,3,1,6],[1,7,1,9],[1,10,1,11],[1,12,1,13],[1,14,1,15],[1,16,1,17],[1,18,1,22],[3,1,3,2]]}
["項目","所属コード",null,"所属名",null,null,null,"所在地",null,null,"電話",null,"携帯電話",null,"代表者名",null,"申込責任者",null,"大　　会　　名"]
["入力",100000,null,{"$f":"IF(B2=\"\",\"\",VLOOKUP(B2,初期設定!$D$2:$I$513,4,FALSE))","v":"群馬陸協"}]
[]
[null,"上段の"]
[]
["No","氏　　名","学年","ﾌﾘｶﾞﾅ","ローマ字","男１・女２","国籍","生年月日","ナンバーカード","4R","16R","32R","ｺｰﾄﾞ","種目1","記録","大会","ｺｰﾄﾞ","種目2","記録","大会","ｺｰﾄﾞ","種目3","記録","大会","所属ｺｰﾄﾞ",null,"注",null,"ｺｰﾄﾞ","種目",null,null,null,null,"学年\n性"]
[1,null,null,null,null,null,null,null,null,null,null,null,null,{"$f":"IF(M7=\"\",\"\",VLOOKUP(LEFT(M7,3),kyougi,2,1))","v":""},null,null,null,{"$f":"IF(Q7=\"\",\"\",VLOOKUP(LEFT(Q7,3),kyougi,2,1))","v":""},null,null,null,{"$f":"IF(U7=\"\",\"\",VLOOKUP(LEFT(U7,3),kyougi,2,1))","v":""},null,null,{"$f":"IF($B$2=\"\",\"\",$B$2)","v":100000},{"$f":"IF(Y7=\"\",\"\",VLOOKUP(Y7,初期設定!$D$1:$I$416,3,FALSE))","v":"群馬陸協"},"・","このフォームに",{"$f":"IF(初期設定!A2=\"\",\"\",初期設定!A2)","v":"002"},{"$f":"IF(初期設定!B2=\"\",\"\",初期設定!B2)","v":"100m"},null,null,null,null,1]
[2,null,null,null,null,null,null,null,null,null,null,null,null,{"$f":"IF(M8=\"\",\"\",VLOOKUP(LEFT(M8,3),kyougi,2,1))","v":""},null,null,null,{"$f":"IF(Q8=\"\",\"\",VLOOKUP(LEFT(Q8,3),kyougi,2,1))","v":""},null,null,null,{"$f":"IF(U8=\"\",\"\",VLOOKUP(LEFT(U8,3),kyougi,2,1))","v":""},null,null,100000,{"$f":"IF(Y8=\"\",\"\",VLOOKUP(Y8,初期設定!$D$1:$I$416,3,FALSE))","v":"群馬陸協"},null,"必要事項を入力し",{"$f":"IF(初期設定!A3=\"\",\"\",初期設定!A3)","v":"003"},{"$f":"IF(初期設定!B3=\"\",\"\",初期設定!B3)","v":"200m"},null,null,null,null,2]
[3,null,null,null,null,null,null,null,null,null,null,null,null,"",null,null,null,{"$f":"IF(Q9=\"\",\"\",VLOOKUP(LEFT(Q9,3),kyougi,2,1))","v":""},null,null,null,{"$f":"IF(U9=\"\",\"\",VLOOKUP(LEFT(U9,3),kyougi,2,1))","v":""},null,null,100000,{"$f":"IF(Y9=\"\",\"\",VLOOKUP(Y9,初期設定!$D$1:$I$416,3,FALSE))","v":"群馬陸協"},null,"メールにて送付",{"$f":"IF(初期設定!A4=\"\",\"\",初期設定!A4)","v":"004"},{"$f":"IF(初期設定!B4=\"\",\"\",初期設定!B4)","v":"300m"},null,null,null,null,3]
[4,null,null,null,null,null,null,null,null,null,null,null,null,"",null,null,null,{"$f":"IF(Q10=\"\",\"\",VLOOKUP(LEFT(Q10,3),kyougi,2,1))","v":""},null,null,null,{"$f":"IF(U10=\"\",\"\",VLOOKUP(LEFT(U10,3),kyougi,2,1))","v":""},null,null,100000,{"$f":"IF(Y10=\"\",\"\",VLOOKUP(Y10,初期設定!$D$1:$I$416,3,FALSE))","v":"群馬陸協"},null,"してください。",{"$f":"IF(初期設定!A5=\"\",\"\",初期設定!A5)","v":"005"},{"$f":"IF(初期設定!B5=\"\",\"\",初期設定!B5)","v":"400m"},null,null,null,null,4]
{"$rows_left_out":88}
{"sheet":"印刷","index":1,"n_rows":39,"n_cols":24,"rows_kept":39,"cut":false,"hidden":false,"merged":[[0,7,0,16],[1,3,1,7],[1,20,1,22],[2,3,2,9],[2,11,2,13],[2,15,2,17],[2,20,2,22],[3,12,3,15],[3,16,3,19],[3,20,3,23]]}
[null,"所属ｺｰﾄﾞ",null,{"$f":"IF(申込一覧表A!B2=\"\",\"\",申込一覧表A!B2)","v":100000},null,null,"大会名",{"$f":"IF(申込一覧表A!S2=\"\",\"\",申込一覧表A!S2)","v":""},null,null,null,null,null,null,null,null,null,null,"大会申込一覧表（Ａ）",null,null,null,null,"NO.1"]
[null,"所属名",null,{"$f":"IF(申込一覧表A!D2=\"\",\"\",申込一覧表A!D2)","v":"群馬陸協"},null,null,null,null,null,null,null,null,null,null,null,null,null,null,"代表者名",null,{"$f":"IF(申込一覧表A!O2=\"\",\"\",申込一覧表A!O2)","v":""}]
[null,"所在地",null,{"$f":"IF(申込一覧表A!H2=\"\",\"\",申込一覧表A!H2)","v":""},null,null,null,null,null,null,"電話",{"$f":"IF(申込一覧表A!K2=\"\",\"\",申込一覧表A!K2)","v":""},null,null,"携帯電話",{"$f":"IF(申込一覧表A!M2=\"\",\"\",申込一覧表A!M2)","v":""},null,null,"申込責任者",null,{"$f":"IF(申込一覧表A!Q2=\"\",\"\",申込一覧表A!Q2)","v":""}]
[null,null,null,null,null,null,null,null,null,"４R","16R","32R","１種目",null,null,null,"２種目",null,null,null,"３種目"]
[null,"氏　　名","学","ﾌﾘｶﾞﾅ","ローマ字","性","国籍","生年月日","Zken","記録","記録","記録","ｺｰﾄﾞ","種目1","記録","大会","ｺｰﾄﾞ","種目2","記録","大会","ｺｰﾄﾞ","種目3","記録","大会"]
[61,null,null,null,null,null,"",null,null,null,null,null,null,"",null,null,null,"",null,null,null,""]
[62,null,null,null,null,null,"",null,null,null,null,null,null,"",null,null,null,"",null,null,null,""]
[63,null,null,null,null,null,"",null,null,null,null,null,null,"",null,null,null,"",null,null,null,""]
[64,null,null,null,null,null,"",null,null,null,null,null,null,"",null,null,null,"",null,null,null,""]
[65,null,null,null,null,null,"",null,null,null,null,null,null,"",null,null,null,"",null,null,null,""]
{"$rows_left_out":30}
{"sheet":"種目人数表B","index":2,"n_rows":55,"n_cols":6,"rows_kept":55,"cut":false,"hidden":false,"merged":[[1,2,1,5],[2,2,2,5]]}
[null,"申込一覧表Ｂ表"]
[null,"大会名",{"$f":"IF(申込一覧表A!S2=\"\",\"\",申込一覧表A!S2)","v":""}]
[null,"学校名",{"$f":"IF(申込一覧表A!D2=\"\",\"\",申込一覧表A!D2)","v":"群馬陸協"}]
[]
["code","男子","種目人数","code","女子","種目人数"]
["002",{"$f":"IF(A6=\"\",\"\",VLOOKUP(A6,kyougi,2,FALSE))","v":"100m"},{"$f":"SUMPRODUCT((申込一覧表A!$F$2:$F$91=1)*(LEFT(申込一覧表A!$M$2:$M$91,3)=A6))+SUMPRODUCT((申込一覧表A!$F$2:$F$91=1)*(LEFT(申込一覧表A!$Q$2:$Q$91,3)=A6))+SUMPRODUCT((申込一覧表A!$F$2:$F$91=1)*(LEFT(申込一覧表A!$U$2:$U$91,3)=A6))","v":0},"002",{"$f":"IF(D6=\"\",\"\",VLOOKUP(D6,kyougi,2,FALSE))","v":"100m"},{"$f":"IF(D6=\"\",\"\",SUMPRODUCT((申込一覧表A!$F$2:$F$91=2)*(LEFT(申込一覧表A!$M$2:$M$91,3)=D6))+SUMPRODUCT((申込一覧表A!$F$2:$F$91=2)*(LEFT(申込一覧表A!$Q$2:$Q$91,3)=D6))+SUMPRODUCT((申込一覧表A!$F$2:$F$91=2)*(LEFT(申込一覧表A!$U$2:$U$91,3)=D6)))","v":0}]
["003","200m",{"$f":"SUMPRODUCT((申込一覧表A!$F$2:$F$91=1)*(LEFT(申込一覧表A!$M$2:$M$91,3)=A7))+SUMPRODUCT((申込一覧表A!$F$2:$F$91=1)*(LEFT(申込一覧表A!$Q$2:$Q$91,3)=A7))+SUMPRODUCT((申込一覧表A!$F$2:$F$91=1)*(LEFT(申込一覧表A!$U$2:$U$91,3)=A7))","v":0},"003","200m",{"$f":"SUMPRODUCT((申込一覧表A!$F$2:$F$91=2)*(LEFT(申込一覧表A!$M$2:$M$91,3)=D7))+SUMPRODUCT((申込一覧表A!$F$2:$F$91=2)*(LEFT(申込一覧表A!$Q$2:$Q$91,3)=D7))+SUMPRODUCT((申込一覧表A!$F$2:$F$91=2)*(LEFT(申込一覧表A!$U$2:$U$91,3)=D7))","v":0}]
["004","300m",{"$f":"SUMPRODUCT((申込一覧表A!$F$2:$F$91=1)*(LEFT(申込一覧表A!$M$2:$M$91,3)=A8))+SUMPRODUCT((申込一覧表A!$F$2:$F$91=1)*(LEFT(申込一覧表A!$Q$2:$Q$91,3)=A8))+SUMPRODUCT((申込一覧表A!$F$2:$F$91=1)*(LEFT(申込一覧表A!$U$2:$U$91,3)=A8))","v":0},"004","300m",{"$f":"SUMPRODUCT((申込一覧表A!$F$2:$F$91=2)*(LEFT(申込一覧表A!$M$2:$M$91,3)=D8))+SUMPRODUCT((申込一覧表A!$F$2:$F$91=2)*(LEFT(申込一覧表A!$Q$2:$Q$91,3)=D8))+SUMPRODUCT((申込一覧表A!$F$2:$F$91=2)*(LEFT(申込一覧表A!$U$2:$U$91,3)=D8))","v":0}]
["005","400m",{"$f":"SUMPRODUCT((申込一覧表A!$F$2:$F$91=1)*(LEFT(申込一覧表A!$M$2:$M$91,3)=A9))+SUMPRODUCT((申込一覧表A!$F$2:$F$91=1)*(LEFT(申込一覧表A!$Q$2:$Q$91,3)=A9))+SUMPRODUCT((申込一覧表A!$F$2:$F$91=1)*(LEFT(申込一覧表A!$U$2:$U$91,3)=A9))","v":0},"005","400m",{"$f":"SUMPRODUCT((申込一覧表A!$F$2:$F$91=2)*(LEFT(申込一覧表A!$M$2:$M$91,3)=D9))+SUMPRODUCT((申込一覧表A!$F$2:$F$91=2)*(LEFT(申込一覧表A!$Q$2:$Q$91,3)=D9))+SUMPRODUCT((申込一覧表A!$F$2:$F$91=2)*(LEFT(申込一覧表A!$U$2:$U$91,3)=D9))","v":0}]
["006","800m",{"$f":"SUMPRODUCT((申込一覧表A!$F$2:$F$91=1)*(LEFT(申込一覧表A!$M$2:$M$91,3)=A10))+SUMPRODUCT((申込一覧表A!$F$2:$F$91=1)*(LEFT(申込一覧表A!$Q$2:$Q$91,3)=A10))+SUMPRODUCT((申込一覧表A!$F$2:$F$91=1)*(LEFT(申込一覧表A!$U$2:$U$91,3)=A10))","v":0},"006","800m",{"$f":"SUMPRODUCT((申込一覧表A!$F$2:$F$91=2)*(LEFT(申込一覧表A!$M$2:$M$91,3)=D10))+SUMPRODUCT((申込一覧表A!$F$2:$F$91=2)*(LEFT(申込一覧表A!$Q$2:$Q$91,3)=D10))+SUMPRODUCT((申込一覧表A!$F$2:$F$91=2)*(LEFT(申込一覧表A!$U$2:$U$91,3)=D10))","v":0}]
{"$rows_left_out":46}
{"sheet":"混成申込","index":3,"n_rows":37,"n_cols":10,"rows_kept":37,"cut":false,"hidden":false,"merged":[[2,0,2,7],[4,1,4,3],[5,1,5,3],[6,1,6,3],[8,3,8,5],[8,6,8,7],[20,0,20,7],[22,1,22,3],[23,1,23,3],[24,1,24,3],[26,3,26,5],[26,6,26,7],[8,0,9,0],[26,0,27,0],[8,1,9,1],[26,1,27,1],[8,2,9,2],[26,2,27,2]]}
["※高校総体エントリー時のみ必要"]
["※申込一覧表Aにはコードのみ入力し、記録は空欄です。",null,null,null,null,null,null,null,"100m","200m"]
["混成競技申込用紙（男子）",null,null,null,null,null,null,null,"400m","800m"]
[null,null,null,null,null,null,null,null,"1500m","100mH"]
["大会名","群馬県高等学校総合体育大会",null,null,null,null,null,null,"110mH","中学100mH"]
["学校名",{"$f":"申込一覧表A!D2","v":"群馬陸協"},null,null,null,null,null,null,"中学110mH","走高跳"]
["種　目","八種競技",null,null,null,null,null,null,"走高跳","走幅跳"]
[null,null,null,null,null,null,null,null,"走幅跳","砲丸投"]
["登録番号","氏名","学年","資格審査",null,null,"走高跳",null,"砲丸投","砲丸投（2.72kg）"]
[null,null,null,"標準記録突破種目","記録","競技会名","最高記録","開始高さ","砲丸投（5kg）","やり投"]
{"$rows_left_out":28}
{"sheet":"初期設定","index":4,"n_rows":471,"n_cols":9,"rows_kept":471,"cut":false,"hidden":false,"merged":[]}
["ｺｰﾄﾞ","種目",null,"DB","N1","N2","N3","KC"]
["002","100m",null,69009,"ﾄｳﾖｳﾀﾞｲ","東洋大","東洋大",6,"山　形"]
["003","200m",null,90001,"ﾄﾁｷﾞTFC","栃木TFC","栃木TFC",9,"栃　木"]
["004","300m",null,100000,"ｸﾞﾝﾏﾘｯｷｮｳ","群馬陸協","群馬陸協",10,"群　馬"]
["005","400m",null,100001,"ﾀｶｻｷｼﾘｯｷｮｳ","高崎市陸協","高崎市陸協",10,"群　馬"]
["006","800m",null,100002,"ｱｶﾞﾂﾏｼﾝﾚｲｸﾗﾌﾞ","吾妻榛嶺ク","吾妻榛嶺ク",10,"群　馬"]
["007","1000m",null,100003,"ｳｽｲｸ","碓氷ク","碓氷ク",10,"群　馬"]
["008","1500m",null,100004,"ﾀﾃﾊﾞﾔｼｸﾗﾌﾞ","館林ク","館林ク",10,"群　馬"]
["010","3000m",null,100005,"ｵｵﾏﾏｺｳOB","大高ＯＢ","大高ＯＢ",10,"群　馬"]
["011","5000m",null,100006,"ﾄｳｷｮｳﾃﾞﾝﾘｮｸ","東京電力","東京電力",10,"群　馬"]
{"$rows_left_out":462}
{"sheet":"DAT","index":5,"n_rows":92,"n_cols":19,"rows_kept":92,"cut":false,"hidden":false,"merged":[]}
["DB","N1","N2","SX","KC","MC","ZK","S1","S2","S3",null,"4R","16R","32R",null,"N3","SX2","NT","GD"]
[null,{"$f":"IF(申込一覧表A!B7=\"\",\"\",IF(申込一覧表A!C7=\"\",申込一覧表A!B7,申込一覧表A!B7&\"(\"&申込一覧表A!C7&\")\"))","v":""},{"$f":"IF(申込一覧表A!D7=\"\",\"\",申込一覧表A!D7)","v":""},{"$f":"IF(申込一覧表A!F7=\"\",\"\",申込一覧表A!F7)","v":""},10,{"$f":"IF(申込一覧表A!Y7=\"\",\"\",申込一覧表A!Y7)","v":100000},{"$f":"IF(申込一覧表A!I7=\"\",\"\",申込一覧表A!I7)","v":""},{"$f":"IF(申込一覧表A!M7=\"\",\"\",申込一覧表A!M7&\" \"&申込一覧表A!O7)","v":""},{"$f":"IF(申込一覧表A!Q7=\"\",\"\",申込一覧表A!Q7&\" \"&申込一覧表A!S7)","v":""},{"$f":"IF(申込一覧表A!U7=\"\",\"\",申込一覧表A!U7&\" \"&申込一覧表A!W7)","v":""},null,{"$f":"IF(申込一覧表A!J7=\"\",\"\",\"0\"&申込一覧表A!J7)","v":""},{"$f":"IF(申込一覧表A!K7=\"\",\"\",申込一覧表A!K7)","v":""},{"$f":"IF(申込一覧表A!L7=\"\",\"\",申込一覧表A!L7)","v":""},null,{"$f":"IF(申込一覧表A!E7=\"\",\"\",申込一覧表A!E7)","v":""},{"$f":"IF(D2=\"\",\"\",IF(D2=1,\"m\",\"f\"))","v":""},{"$f":"IF(申込一覧表A!G7=\"\",\"\",申込一覧表A!G7)","v":""},{"$f":"IF(申込一覧表A!H7=\"\",\"\",申込一覧表A!H7)","v":""}]
[null,{"$f":"IF(申込一覧表A!B8=\"\",\"\",IF(申込一覧表A!C8=\"\",申込一覧表A!B8,申込一覧表A!B8&\"(\"&申込一覧表A!C8&\")\"))","v":""},{"$f":"IF(申込一覧表A!D8=\"\",\"\",申込一覧表A!D8)","v":""},{"$f":"IF(申込一覧表A!F8=\"\",\"\",申込一覧表A!F8)","v":""},10,{"$f":"IF(申込一覧表A!Y8=\"\",\"\",申込一覧表A!Y8)","v":100000},{"$f":"IF(申込一覧表A!I8=\"\",\"\",申込一覧表A!I8)","v":""},{"$f":"IF(申込一覧表A!M8=\"\",\"\",申込一覧表A!M8&\" \"&申込一覧表A!O8)","v":""},{"$f":"IF(申込一覧表A!Q8=\"\",\"\",申込一覧表A!Q8&\" \"&申込一覧表A!S8)","v":""},{"$f":"IF(申込一覧表A!U8=\"\",\"\",申込一覧表A!U8&\" \"&申込一覧表A!W8)","v":""},null,{"$f":"IF(申込一覧表A!J8=\"\",\"\",\"0\"&申込一覧表A!J8)","v":""},{"$f":"IF(申込一覧表A!K8=\"\",\"\",申込一覧表A!K8)","v":""},{"$f":"IF(申込一覧表A!L8=\"\",\"\",申込一覧表A!L8)","v":""},null,{"$f":"IF(申込一覧表A!E8=\"\",\"\",申込一覧表A!E8)","v":""},"",{"$f":"IF(申込一覧表A!G8=\"\",\"\",申込一覧表A!G8)","v":""},{"$f":"IF(申込一覧表A!H8=\"\",\"\",申込一覧表A!H8)","v":""}]
[null,{"$f":"IF(申込一覧表A!B9=\"\",\"\",IF(申込一覧表A!C9=\"\",申込一覧表A!B9,申込一覧表A!B9&\"(\"&申込一覧表A!C9&\")\"))","v":""},{"$f":"IF(申込一覧表A!D9=\"\",\"\",申込一覧表A!D9)","v":""},{"$f":"IF(申込一覧表A!F9=\"\",\"\",申込一覧表A!F9)","v":""},10,{"$f":"IF(申込一覧表A!Y9=\"\",\"\",申込一覧表A!Y9)","v":100000},{"$f":"IF(申込一覧表A!I9=\"\",\"\",申込一覧表A!I9)","v":""},{"$f":"IF(申込一覧表A!M9=\"\",\"\",申込一覧表A!M9&\" \"&申込一覧表A!O9)","v":""},{"$f":"IF(申込一覧表A!Q9=\"\",\"\",申込一覧表A!Q9&\" \"&申込一覧表A!S9)","v":""},{"$f":"IF(申込一覧表A!U9=\"\",\"\",申込一覧表A!U9&\" \"&申込一覧表A!W9)","v":""},null,{"$f":"IF(申込一覧表A!J9=\"\",\"\",\"0\"&申込一覧表A!J9)","v":""},{"$f":"IF(申込一覧表A!K9=\"\",\"\",申込一覧表A!K9)","v":""},{"$f":"IF(申込一覧表A!L9=\"\",\"\",申込一覧表A!L9)","v":""},null,{"$f":"IF(申込一覧表A!E9=\"\",\"\",申込一覧表A!E9)","v":""},"",{"$f":"IF(申込一覧表A!G9=\"\",\"\",申込一覧表A!G9)","v":""},{"$f":"IF(申込一覧表A!H9=\"\",\"\",申込一覧表A!H9)","v":""}]
[null,{"$f":"IF(申込一覧表A!B10=\"\",\"\",IF(申込一覧表A!C10=\"\",申込一覧表A!B10,申込一覧表A!B10&\"(\"&申込一覧表A!C10&\")\"))","v":""},{"$f":"IF(申込一覧表A!D10=\"\",\"\",申込一覧表A!D10)","v":""},{"$f":"IF(申込一覧表A!F10=\"\",\"\",申込一覧表A!F10)","v":""},10,{"$f":"IF(申込一覧表A!Y10=\"\",\"\",申込一覧表A!Y10)","v":100000},{"$f":"IF(申込一覧表A!I10=\"\",\"\",申込一覧表A!I10)","v":""},{"$f":"IF(申込一覧表A!M10=\"\",\"\",申込一覧表A!M10&\" \"&申込一覧表A!O10)","v":""},{"$f":"IF(申込一覧表A!Q10=\"\",\"\",申込一覧表A!Q10&\" \"&申込一覧表A!S10)","v":""},{"$f":"IF(申込一覧表A!U10=\"\",\"\",申込一覧表A!U10&\" \"&申込一覧表A!W10)","v":""},null,{"$f":"IF(申込一覧表A!J10=\"\",\"\",\"0\"&申込一覧表A!J10)","v":""},{"$f":"IF(申込一覧表A!K10=\"\",\"\",申込一覧表A!K10)","v":""},{"$f":"IF(申込一覧表A!L10=\"\",\"\",申込一覧表A!L10)","v":""},null,{"$f":"IF(申込一覧表A!E10=\"\",\"\",申込一覧表A!E10)","v":""},"",{"$f":"IF(申込一覧表A!G10=\"\",\"\",申込一覧表A!G10)","v":""},{"$f":"IF(申込一覧表A!H10=\"\",\"\",申込一覧表A!H10)","v":""}]
[null,{"$f":"IF(申込一覧表A!B11=\"\",\"\",IF(申込一覧表A!C11=\"\",申込一覧表A!B11,申込一覧表A!B11&\"(\"&申込一覧表A!C11&\")\"))","v":""},{"$f":"IF(申込一覧表A!D11=\"\",\"\",申込一覧表A!D11)","v":""},{"$f":"IF(申込一覧表A!F11=\"\",\"\",申込一覧表A!F11)","v":""},10,{"$f":"IF(申込一覧表A!Y11=\"\",\"\",申込一覧表A!Y11)","v":100000},{"$f":"IF(申込一覧表A!I11=\"\",\"\",申込一覧表A!I11)","v":""},{"$f":"IF(申込一覧表A!M11=\"\",\"\",申込一覧表A!M11&\" \"&申込一覧表A!O11)","v":""},{"$f":"IF(申込一覧表A!Q11=\"\",\"\",申込一覧表A!Q11&\" \"&申込一覧表A!S11)","v":""},{"$f":"IF(申込一覧表A!U11=\"\",\"\",申込一覧表A!U11&\" \"&申込一覧表A!W11)","v":""},null,{"$f":"IF(申込一覧表A!J11=\"\",\"\",\"0\"&申込一覧表A!J11)","v":""},{"$f":"IF(申込一覧表A!K11=\"\",\"\",申込一覧表A!K11)","v":""},{"$f":"IF(申込一覧表A!L11=\"\",\"\",申込一覧表A!L11)","v":""},null,{"$f":"IF(申込一覧表A!E11=\"\",\"\",申込一覧表A!E11)","v":""},"",{"$f":"IF(申込一覧表A!G11=\"\",\"\",申込一覧表A!G11)","v":""},{"$f":"IF(申込一覧表A!H11=\"\",\"\",申込一覧表A!H11)","v":""}]
[null,{"$f":"IF(申込一覧表A!B12=\"\",\"\",IF(申込一覧表A!C12=\"\",申込一覧表A!B12,申込一覧表A!B12&\"(\"&申込一覧表A!C12&\")\"))","v":""},{"$f":"IF(申込一覧表A!D12=\"\",\"\",申込一覧表A!D12)","v":""},{"$f":"IF(申込一覧表A!F12=\"\",\"\",申込一覧表A!F12)","v":""},10,{"$f":"IF(申込一覧表A!Y12=\"\",\"\",申込一覧表A!Y12)","v":100000},{"$f":"IF(申込一覧表A!I12=\"\",\"\",申込一覧表A!I12)","v":""},{"$f":"IF(申込一覧表A!M12=\"\",\"\",申込一覧表A!M12&\" \"&申込一覧表A!O12)","v":""},{"$f":"IF(申込一覧表A!Q12=\"\",\"\",申込一覧表A!Q12&\" \"&申込一覧表A!S12)","v":""},{"$f":"IF(申込一覧表A!U12=\"\",\"\",申込一覧表A!U12&\" \"&申込一覧表A!W12)","v":""},null,{"$f":"IF(申込一覧表A!J12=\"\",\"\",\"0\"&申込一覧表A!J12)","v":""},{"$f":"IF(申込一覧表A!K12=\"\",\"\",申込一覧表A!K12)","v":""},{"$f":"IF(申込一覧表A!L12=\"\",\"\",申込一覧表A!L12)","v":""},null,{"$f":"IF(申込一覧表A!E12=\"\",\"\",申込一覧表A!E12)","v":""},"",{"$f":"IF(申込一覧表A!G12=\"\",\"\",申込一覧表A!G12)","v":""},{"$f":"IF(申込一覧表A!H12=\"\",\"\",申込一覧表A!H12)","v":""}]
[null,{"$f":"IF(申込一覧表A!B13=\"\",\"\",IF(申込一覧表A!C13=\"\",申込一覧表A!B13,申込一覧表A!B13&\"(\"&申込一覧表A!C13&\")\"))","v":""},{"$f":"IF(申込一覧表A!D13=\"\",\"\",申込一覧表A!D13)","v":""},{"$f":"IF(申込一覧表A!F13=\"\",\"\",申込一覧表A!F13)","v":""},10,{"$f":"IF(申込一覧表A!Y13=\"\",\"\",申込一覧表A!Y13)","v":100000},{"$f":"IF(申込一覧表A!I13=\"\",\"\",申込一覧表A!I13)","v":""},{"$f":"IF(申込一覧表A!M13=\"\",\"\",申込一覧表A!M13&\" \"&申込一覧表A!O13)","v":""},{"$f":"IF(申込一覧表A!Q13=\"\",\"\",申込一覧表A!Q13&\" \"&申込一覧表A!S13)","v":""},{"$f":"IF(申込一覧表A!U13=\"\",\"\",申込一覧表A!U13&\" \"&申込一覧表A!W13)","v":""},null,{"$f":"IF(申込一覧表A!J13=\"\",\"\",\"0\"&申込一覧表A!J13)","v":""},{"$f":"IF(申込一覧表A!K13=\"\",\"\",申込一覧表A!K13)","v":""},{"$f":"IF(申込一覧表A!L13=\"\",\"\",申込一覧表A!L13)","v":""},null,{"$f":"IF(申込一覧表A!E13=\"\",\"\",申込一覧表A!E13)","v":""},"",{"$f":"IF(申込一覧表A!G13=\"\",\"\",申込一覧表A!G13)","v":""},{"$f":"IF(申込一覧表A!H13=\"\",\"\",申込一覧表A!H13)","v":""}]
[null,{"$f":"IF(申込一覧表A!B14=\"\",\"\",IF(申込一覧表A!C14=\"\",申込一覧表A!B14,申込一覧表A!B14&\"(\"&申込一覧表A!C14&\")\"))","v":""},{"$f":"IF(申込一覧表A!D14=\"\",\"\",申込一覧表A!D14)","v":""},{"$f":"IF(申込一覧表A!F14=\"\",\"\",申込一覧表A!F14)","v":""},10,{"$f":"IF(申込一覧表A!Y14=\"\",\"\",申込一覧表A!Y14)","v":100000},{"$f":"IF(申込一覧表A!I14=\"\",\"\",申込一覧表A!I14)","v":""},{"$f":"IF(申込一覧表A!M14=\"\",\"\",申込一覧表A!M14&\" \"&申込一覧表A!O14)","v":""},{"$f":"IF(申込一覧表A!Q14=\"\",\"\",申込一覧表A!Q14&\" \"&申込一覧表A!S14)","v":""},{"$f":"IF(申込一覧表A!U14=\"\",\"\",申込一覧表A!U14&\" \"&申込一覧表A!W14)","v":""},null,{"$f":"IF(申込一覧表A!J14=\"\",\"\",\"0\"&申込一覧表A!J14)","v":""},{"$f":"IF(申込一覧表A!K14=\"\",\"\",申込一覧表A!K14)","v":""},{"$f":"IF(申込一覧表A!L14=\"\",\"\",申込一覧表A!L14)","v":""},null,{"$f":"IF(申込一覧表A!E14=\"\",\"\",申込一覧表A!E14)","v":""},"",{"$f":"IF(申込一覧表A!G14=\"\",\"\",申込一覧表A!G14)","v":""},{"$f":"IF(申込一覧表A!H14=\"\",\"\",申込一覧表A!H14)","v":""}]
[null,{"$f":"IF(申込一覧表A!B15=\"\",\"\",IF(申込一覧表A!C15=\"\",申込一覧表A!B15,申込一覧表A!B15&\"(\"&申込一覧表A!C15&\")\"))","v":""},{"$f":"IF(申込一覧表A!D15=\"\",\"\",申込一覧表A!D15)","v":""},{"$f":"IF(申込一覧表A!F15=\"\",\"\",申込一覧表A!F15)","v":""},10,{"$f":"IF(申込一覧表A!Y15=\"\",\"\",申込一覧表A!Y15)","v":100000},{"$f":"IF(申込一覧表A!I15=\"\",\"\",申込一覧表A!I15)","v":""},{"$f":"IF(申込一覧表A!M15=\"\",\"\",申込一覧表A!M15&\" \"&申込一覧表A!O15)","v":""},{"$f":"IF(申込一覧表A!Q15=\"\",\"\",申込一覧表A!Q15&\" \"&申込一覧表A!S15)","v":""},{"$f":"IF(申込一覧表A!U15=\"\",\"\",申込一覧表A!U15&\" \"&申込一覧表A!W15)","v":""},null,{"$f":"IF(申込一覧表A!J15=\"\",\"\",\"0\"&申込一覧表A!J15)","v":""},{"$f":"IF(申込一覧表A!K15=\"\",\"\",申込一覧表A!K15)","v":""},{"$f":"IF(申込一覧表A!L15=\"\",\"\",申込一覧表A!L15)","v":""},null,{"$f":"IF(申込一覧表A!E15=\"\",\"\",申込一覧表A!E15)","v":""},"",{"$f":"IF(申込一覧表A!G15=\"\",\"\",申込一覧表A!G15)","v":""},{"$f":"IF(申込一覧表A!H15=\"\",\"\",申込一覧表A!H15)","v":""}]
{"$rows_left_out":82}